{"text_format":"1","workbook":"xlsx","n_sheets":11,"sheets":["0. History","Instructions","Intervention record","DB-Student groups","DB-Outcomes","DB-Activities","DB-EORR","DB-Outcomes|Student Group","DB-Outcomes|Activity","Stats","EORR"],"not_rendered":{"charts":8,"images":1,"macros":1,"external_links":0,"defined_names":8,"comments":0,"pivot_tables":0},"unopened":[],"bounds":{"document_bytes":16777216,"sheet_cells":100000,"rows_first":2000,"rows_last":500,"rows_between":2000,"halvings":0,"cell_chars":16384,"cell_head_chars":4096},"cells_cut":0,"cells_raw":0,"read":"whole","date_system":"1900"}

{"sheet":"0. History","index":0,"n_rows":5,"n_cols":4,"rows_kept":5,"cut":false,"hidden":false,"merged":[]}
[]
["Information (version number will always match that of the Post-Entry MOAT this sheet corresponds with)","Version","Date","Changes since last version"]
["First public version of intervention recording worksheet ","1.0","2024-04-23","-"]
["Bug fix","1.0","2024-09-09","The CONCAT function in Columns I, J, K and L in the Stats sheet was pointing to the wrong row (3 instead of 4). Now fixed. Thanks to Alice Stinetorf for spotting and fixing the issue."]
["Update",1.1000000000000001,"2025-07-27","Updates to activity type and sub-type to match v1.1 of Post-entry MOAT"]

{"sheet":"Instructions","index":1,"n_rows":0,"n_cols":0,"rows_kept":0,"cut":false,"hidden":false,"merged":[]}

{"sheet":"Intervention record","index":2,"n_rows":9,"n_cols":14,"rows_kept":9,"cut":false,"hidden":false,"merged":[[0,0,0,1],[0,2,0,3],[1,12,1,13]]}
[null,null,"Example sheet to record interventions"]
[null,"Beneficiaries",null,null,"Outcomes",null,null,null,null,null,"Activity",null,"Logistics"]
["Intervention name","Provider level(s)","Student Group(s)","Student sub-group","Primary Outcome","Secondary outcome 1","Secondary outcome 2","Secondary outcome 3","Secondary outcome 4","EORR Risk(s)","Activity Type","Activity Sub-type","Delivery","Organiser"]
["Score as I learn (SAIL)","Course","Students with non-traditional qualifications\r\nOther","Students with BTECs and International Students","engagement (curriculum)","attainment","student self-regulation",null,null,null,"Course delivery","Assessment change","Online","Academic staff"]
["Black leadership Programme","Whole provider\r\nYear group","Marginalised ethnic groups","Black Students","engagement (curriculum)","wellbeing","social self-efficacy","sense of belonging","cognitive strategies",null,"Extra-curricular activities","Culture and community development ","Face-to-face","External stakeholder/support\r\nPeer\r\nStudent support staff"]
["Peer assisted learning (Mentees)","Whole provider\r\nYear group","Other","First-year students","attainment","skills and knowledge to successfully make the transition to HE","continuation","academic self-efficacy","social self-efficacy",null,"Educational support","Tutoring/Mentoring","Face-to-face\r\nIndividual\r\nGroup","Peer"]
["Peer assisted learning (Mentors)","Whole provider\r\nYear group","Other","Second-year students","attainment","completion","positive progression","social self-efficacy",null,null,"Educational support","Student tutor/mentor","Face-to-face\r\nIndividual\r\nGroup","Peer"]
["Lancaster Success Programme","Whole provider\r\nYear group","Contextual offer holder\r\nStudents with non-traditional qualifications\r\nStudents selected using area-based measures","POLAR4 Quintile 1","attainment","academic self-efficacy","sense of belonging","positive progression","social self-efficacy",null,"Transition into HE","Coaching","Face-to-face\r\nIndividual\r\nGroup","Peer"]
["Supporting Disabled Students","Whole provider\r\nYear group","Disabled students (inc. Special Educational Needs)",null,"enrolment ","confidence to declare support needs","knowledge of support available","skills and knowledge to successfully make the transition to higher education","parent: knowledge of support available",null,"Pastoral support","Transition into higher education","Face-to-face\r\nIndividual\r\nGroup","Student support staff"]

{"sheet":"DB-Student groups","index":3,"n_rows":0,"n_cols":0,"rows_kept":0,"cut":false,"hidden":false,"merged":[]}

{"sheet":"DB-Outcomes","index":4,"n_rows":0,"n_cols":0,"rows_kept":0,"cut":false,"hidden":false,"merged":[]}

{"sheet":"DB-Activities","index":5,"n_rows":0,"n_cols":0,"rows_kept":0,"cut":false,"hidden":false,"merged":[]}

{"sheet":"DB-EORR","index":6,"n_rows":0,"n_cols":0,"rows_kept":0,"cut":false,"hidden":false,"merged":[]}

{"sheet":"DB-Outcomes|Student Group","index":7,"n_rows":3,"n_cols":13,"rows_kept":3,"cut":false,"hidden":false,"merged":[]}
["Student Group",{"$f":"\"Outcomes for interventions with the target student group: \" & A2","v":"Outcomes for interventions with the target student group: Contextual offer holder"},null,"Beneficiaries",null,null,"Outcomes",null,null,null,null,null,"Activity"]
["Contextual offer holder",null,"Intervention name","Institution level(s)","Student Group(s)","Student sub-group","Primary Outcome","Secondary outcome 1","Secondary outcome 2","Secondary outcome 3","Secondary outcome 4","EORR Risk(s)","Activity Type"]
[null,null,{"$f":"_xlfn._xlws.FILTER('Intervention record'!$A$4:$I$99,ISNUMBER(SEARCH($A$2,'Intervention record'!$C$4:$C$99)),\"\")","v":"Lancaster Success Programme"},"Whole provider\r\nYear group","Contextual offer holder\r\nStudents with non-traditional qualifications\r\nStudents selected using area-based measures","POLAR4 Quintile 1","attainment","academic self-efficacy","sense of belonging","positive progression","social self-efficacy"]

{"sheet":"DB-Outcomes|Activity","index":8,"n_rows":3,"n_cols":13,"rows_kept":3,"cut":false,"hidden":false,"merged":[]}
["Activity type",{"$f":"\"Outcomes for \" & A2 & \" interventions\"","v":"Outcomes for Careers support interventions"},null,"Beneficiaries",null,null,"Outcomes",null,null,null,null,null,"Activity"]
["Careers support",null,"Intervention name","Institution level(s)","Student Group(s)","Student sub-group","Primary Outcome","Secondary outcome 1","Secondary outcome 2","Secondary outcome 3","Secondary outcome 4","EORR Risk(s)","Activity Type"]
[null,null,{"$f":"_xlfn._xlws.FILTER('Intervention record'!$A$4:$I$99,ISNUMBER(SEARCH($A$2,'Intervention record'!$K$4:$K$99)),\"\")","v":""}]

{"sheet":"Stats","index":9,"n_rows":37,"n_cols":20,"rows_kept":37,"cut":false,"hidden":false,"merged":[[1,6,1,7],[1,8,1,9],[1,10,1,11]]}
[null,null,null,null,null,null,null,null,"By Student Group",null,"By Activity Subtype"]
[null,null,null,null,null,null,"Overall",null,{"$f":"'DB-Outcomes|Student Group'!A2","v":"Contextual offer holder"},null,{"$f":"'DB-Outcomes|Activity'!A2","v":"Careers support"}]
["Institution level","Count","Student Group","Count","Category","Outcome","Primary Outcome","Secondary outcomes","Primary Outcome","Secondary outcomes","Primary Outcome","Secondary outcomes","Activity Type","Type","Activity sub-type","Sub-type","EORR Risk","Count","Delivery","Organiser"]
["Whole provider",{"$f":"COUNTIF('Intervention record'!B$4:B$100,_xlfn.CONCAT(\"\",\"*\",A4,\"*\"))","v":5},"Armed forces family",{"$f":"COUNTIF('Intervention record'!C$4:C$100,_xlfn.CONCAT(\"\",\"*\",C4,\"*\"))","v":0},"Non-behavioural","academic self-efficacy",{"$f":"COUNTIF('Intervention record'!E$4:E$100,_xlfn.CONCAT(\"\",\"*\",$F4,\"*\"))","v":0},{"$f":"COUNTIF('Intervention record'!F$4:I$100,_xlfn.CONCAT(\"\",\"*\",$F4,\"*\"))","v":2},{"$f":"COUNTIF('DB-Outcomes|Student Group'!G$3:G$100,_xlfn.CONCAT(\"\",\"*\",$F4,\"*\"))","v":0},{"$f":"COUNTIF('DB-Outcomes|Student Group'!H$3:K$100,_xlfn.CONCAT(\"\",\"*\",$F4,\"*\"))","v":1},{"$f":"COUNTIF('DB-Outcomes|Activity'!G$3:G$100,_xlfn.CONCAT(\"\",\"*\",$F4,\"*\"))","v":0},{"$f":"COUNTIF('DB-Outcomes|Activity'!H$3:K$100,_xlfn.CONCAT(\"\",\"*\",$F4,\"*\"))","v":0},"Careers support",{"$f":"COUNTIF('Intervention record'!K$4:K$100,_xlfn.CONCAT(\"\",\"*\",M4,\"*\"))","v":0},"Analytics and monitoring",{"$f":"COUNTIF('Intervention record'!L$4:L$100,_xlfn.CONCAT(\"\",\"*\",O4,\"*\"))","v":0},"Risk 1: Knowledge and skills",{"$f":"COUNTIF('Intervention record'!J$4:J$100,_xlfn.CONCAT(\"\",\"*\",Q4,\"*\"))","v":0},"Asynchronous","Academic staff"]
["Year group",{"$f":"COUNTIF('Intervention record'!B$4:B$100,_xlfn.CONCAT(\"\",\"*\",A5,\"*\"))","v":5},"Care experienced",{"$f":"COUNTIF('Intervention record'!C$4:C$100,_xlfn.CONCAT(\"\",\"*\",C5,\"*\"))","v":0},"Non-behavioural","cognitive strategies",{"$f":"COUNTIF('Intervention record'!E$4:E$100,_xlfn.CONCAT(\"\",\"*\",$F5,\"*\"))","v":0},{"$f":"COUNTIF('Intervention record'!F$4:I$100,_xlfn.CONCAT(\"\",\"*\",$F5,\"*\"))","v":1},{"$f":"COUNTIF('DB-Outcomes|Student Group'!G$3:G$100,_xlfn.CONCAT(\"\",\"*\",$F5,\"*\"))","v":0},{"$f":"COUNTIF('DB-Outcomes|Student Group'!H$3:K$100,_xlfn.CONCAT(\"\",\"*\",$F5,\"*\"))","v":0},{"$f":"COUNTIF('DB-Outcomes|Activity'!G$3:G$100,_xlfn.CONCAT(\"\",\"*\",$F5,\"*\"))","v":0},{"$f":"COUNTIF('DB-Outcomes|Activity'!H$3:K$100,_xlfn.CONCAT(\"\",\"*\",$F5,\"*\"))","v":0},"Course delivery",{"$f":"COUNTIF('Intervention record'!K$4:K$100,_xlfn.CONCAT(\"\",\"*\",M5,\"*\"))","v":1},"Assessment change",{"$f":"COUNTIF('Intervention record'!L$4:L$100,_xlfn.CONCAT(\"\",\"*\",O5,\"*\"))","v":1},"Risk 2: Information and guidance",{"$f":"COUNTIF('Intervention record'!J$4:J$100,_xlfn.CONCAT(\"\",\"*\",Q5,\"*\"))","v":0},"Blended","External stakeholder/support"]
["School/Faculty/College",{"$f":"COUNTIF('Intervention record'!B$4:B$100,_xlfn.CONCAT(\"\",\"*\",A6,\"*\"))","v":0},"Carer",{"$f":"COUNTIF('Intervention record'!C$4:C$100,_xlfn.CONCAT(\"\",\"*\",C6,\"*\"))","v":0},"Non-behavioural","confidence in future success (post-HE)",{"$f":"COUNTIF('Intervention record'!E$4:E$100,_xlfn.CONCAT(\"\",\"*\",$F6,\"*\"))","v":0},{"$f":"COUNTIF('Intervention record'!F$4:I$100,_xlfn.CONCAT(\"\",\"*\",$F6,\"*\"))","v":0},{"$f":"COUNTIF('DB-Outcomes|Student Group'!G$3:G$100,_xlfn.CONCAT(\"\",\"*\",$F6,\"*\"))","v":0},{"$f":"COUNTIF('DB-Outcomes|Student Group'!H$3:K$100,_xlfn.CONCAT(\"\",\"*\",$F6,\"*\"))","v":0},{"$f":"COUNTIF('DB-Outcomes|Activity'!G$3:G$100,_xlfn.CONCAT(\"\",\"*\",$F6,\"*\"))","v":0},{"$f":"COUNTIF('DB-Outcomes|Activity'!H$3:K$100,_xlfn.CONCAT(\"\",\"*\",$F6,\"*\"))","v":0},"Educational support",{"$f":"COUNTIF('Intervention record'!K$4:K$100,_xlfn.CONCAT(\"\",\"*\",M6,\"*\"))","v":2},"Coaching",{"$f":"COUNTIF('Intervention record'!L$4:L$100,_xlfn.CONCAT(\"\",\"*\",O6,\"*\"))","v":1},"Risk 3: Perception of higher education",{"$f":"COUNTIF('Intervention record'!J$4:J$100,_xlfn.CONCAT(\"\",\"*\",Q6,\"*\"))","v":0},"Chat-bot","Peer"]
["Department",{"$f":"COUNTIF('Intervention record'!B$4:B$100,_xlfn.CONCAT(\"\",\"*\",A7,\"*\"))","v":0},"Child in need",{"$f":"COUNTIF('Intervention record'!C$4:C$100,_xlfn.CONCAT(\"\",\"*\",C7,\"*\"))","v":0},"Non-behavioural","confidence to declare support needs",{"$f":"COUNTIF('Intervention record'!E$4:E$100,_xlfn.CONCAT(\"\",\"*\",$F7,\"*\"))","v":0},{"$f":"COUNTIF('Intervention record'!F$4:I$100,_xlfn.CONCAT(\"\",\"*\",$F7,\"*\"))","v":1},{"$f":"COUNTIF('DB-Outcomes|Student Group'!G$3:G$100,_xlfn.CONCAT(\"\",\"*\",$F7,\"*\"))","v":0},{"$f":"COUNTIF('DB-Outcomes|Student Group'!H$3:K$100,_xlfn.CONCAT(\"\",\"*\",$F7,\"*\"))","v":0},{"$f":"COUNTIF('DB-Outcomes|Activity'!G$3:G$100,_xlfn.CONCAT(\"\",\"*\",$F7,\"*\"))","v":0},{"$f":"COUNTIF('DB-Outcomes|Activity'!H$3:K$100,_xlfn.CONCAT(\"\",\"*\",$F7,\"*\"))","v":0},"Extra-curricular activities",{"$f":"COUNTIF('Intervention record'!K$4:K$100,_xlfn.CONCAT(\"\",\"*\",M7,\"*\"))","v":1},"Community events",{"$f":"COUNTIF('Intervention record'!L$4:L$100,_xlfn.CONCAT(\"\",\"*\",O7,\"*\"))","v":0},"Risk 4: Application success rates",{"$f":"COUNTIF('Intervention record'!J$4:J$100,_xlfn.CONCAT(\"\",\"*\",Q7,\"*\"))","v":0},"Face-to-face","Postgraduate student"]
["Course",{"$f":"COUNTIF('Intervention record'!B$4:B$100,_xlfn.CONCAT(\"\",\"*\",A8,\"*\"))","v":1},"Commuter students",{"$f":"COUNTIF('Intervention record'!C$4:C$100,_xlfn.CONCAT(\"\",\"*\",C8,\"*\"))","v":0},"Non-behavioural","knowledge of support available",{"$f":"COUNTIF('Intervention record'!E$4:E$100,_xlfn.CONCAT(\"\",\"*\",$F8,\"*\"))","v":0},{"$f":"COUNTIF('Intervention record'!F$4:I$100,_xlfn.CONCAT(\"\",\"*\",$F8,\"*\"))","v":2},{"$f":"COUNTIF('DB-Outcomes|Student Group'!G$3:G$100,_xlfn.CONCAT(\"\",\"*\",$F8,\"*\"))","v":0},{"$f":"COUNTIF('DB-Outcomes|Student Group'!H$3:K$100,_xlfn.CONCAT(\"\",\"*\",$F8,\"*\"))","v":0},{"$f":"COUNTIF('DB-Outcomes|Activity'!G$3:G$100,_xlfn.CONCAT(\"\",\"*\",$F8,\"*\"))","v":0},{"$f":"COUNTIF('DB-Outcomes|Activity'!H$3:K$100,_xlfn.CONCAT(\"\",\"*\",$F8,\"*\"))","v":0},"Financial support",{"$f":"COUNTIF('Intervention record'!K$4:K$100,_xlfn.CONCAT(\"\",\"*\",M8,\"*\"))","v":0},"Creative activities",{"$f":"COUNTIF('Intervention record'!L$4:L$100,_xlfn.CONCAT(\"\",\"*\",O8,\"*\"))","v":0},"Risk 5: Limited choice of course type and delivery mode",{"$f":"COUNTIF('Intervention record'!J$4:J$100,_xlfn.CONCAT(\"\",\"*\",Q8,\"*\"))","v":0},"Group","Student ambassador"]
["Module",{"$f":"COUNTIF('Intervention record'!B$4:B$100,_xlfn.CONCAT(\"\",\"*\",A9,\"*\"))","v":0},"Contextual offer holder",{"$f":"COUNTIF('Intervention record'!C$4:C$100,_xlfn.CONCAT(\"\",\"*\",C9,\"*\"))","v":1},"Non-behavioural","metacognitive strategies",{"$f":"COUNTIF('Intervention record'!E$4:E$100,_xlfn.CONCAT(\"\",\"*\",$F9,\"*\"))","v":0},{"$f":"COUNTIF('Intervention record'!F$4:I$100,_xlfn.CONCAT(\"\",\"*\",$F9,\"*\"))","v":0},{"$f":"COUNTIF('DB-Outcomes|Student Group'!G$3:G$100,_xlfn.CONCAT(\"\",\"*\",$F9,\"*\"))","v":0},{"$f":"COUNTIF('DB-Outcomes|Student Group'!H$3:K$100,_xlfn.CONCAT(\"\",\"*\",$F9,\"*\"))","v":0},{"$f":"COUNTIF('DB-Outcomes|Activity'!G$3:G$100,_xlfn.CONCAT(\"\",\"*\",$F9,\"*\"))","v":0},{"$f":"COUNTIF('DB-Outcomes|Activity'!H$3:K$100,_xlfn.CONCAT(\"\",\"*\",$F9,\"*\"))","v":0},"Learning environment",{"$f":"COUNTIF('Intervention record'!K$4:K$100,_xlfn.CONCAT(\"\",\"*\",M9,\"*\"))","v":0},"Culture and community development ",{"$f":"COUNTIF('Intervention record'!L$4:L$100,_xlfn.CONCAT(\"\",\"*\",O9,\"*\"))","v":1},"Risk 6: Insufficient academic support",{"$f":"COUNTIF('Intervention record'!J$4:J$100,_xlfn.CONCAT(\"\",\"*\",Q9,\"*\"))","v":0},"Individual","Student support staff"]
[null,null,"Disabled students (inc. Special Educational Needs)",{"$f":"COUNTIF('Intervention record'!C$4:C$100,_xlfn.CONCAT(\"\",\"*\",C10,\"*\"))","v":1},"Non-behavioural","motivation",{"$f":"COUNTIF('Intervention record'!E$4:E$100,_xlfn.CONCAT(\"\",\"*\",$F10,\"*\"))","v":0},{"$f":"COUNTIF('Intervention record'!F$4:I$100,_xlfn.CONCAT(\"\",\"*\",$F10,\"*\"))","v":0},{"$f":"COUNTIF('DB-Outcomes|Student Group'!G$3:G$100,_xlfn.CONCAT(\"\",\"*\",$F10,\"*\"))","v":0},{"$f":"COUNTIF('DB-Outcomes|Student Group'!H$3:K$100,_xlfn.CONCAT(\"\",\"*\",$F10,\"*\"))","v":0},{"$f":"COUNTIF('DB-Outcomes|Activity'!G$3:G$100,_xlfn.CONCAT(\"\",\"*\",$F10,\"*\"))","v":0},{"$f":"COUNTIF('DB-Outcomes|Activity'!H$3:K$100,_xlfn.CONCAT(\"\",\"*\",$F10,\"*\"))","v":0},"Pastoral support",{"$f":"COUNTIF('Intervention record'!K$4:K$100,_xlfn.CONCAT(\"\",\"*\",M10,\"*\"))","v":1},"Curriculum delivery change",{"$f":"COUNTIF('Intervention record'!L$4:L$100,_xlfn.CONCAT(\"\",\"*\",O10,\"*\"))","v":0},"Risk 7: Insufficient personal support",{"$f":"COUNTIF('Intervention record'!J$4:J$100,_xlfn.CONCAT(\"\",\"*\",Q10,\"*\"))","v":0},"Lecture","Undergraduate student"]
[null,null,"Estranged",{"$f":"COUNTIF('Intervention record'!C$4:C$100,_xlfn.CONCAT(\"\",\"*\",C11,\"*\"))","v":0},"Non-behavioural","parent: knowledge of support available",{"$f":"COUNTIF('Intervention record'!E$4:E$100,_xlfn.CONCAT(\"\",\"*\",$F11,\"*\"))","v":0},{"$f":"COUNTIF('Intervention record'!F$4:I$100,_xlfn.CONCAT(\"\",\"*\",$F11,\"*\"))","v":1},{"$f":"COUNTIF('DB-Outcomes|Student Group'!G$3:G$100,_xlfn.CONCAT(\"\",\"*\",$F11,\"*\"))","v":0},{"$f":"COUNTIF('DB-Outcomes|Student Group'!H$3:K$100,_xlfn.CONCAT(\"\",\"*\",$F11,\"*\"))","v":0},{"$f":"COUNTIF('DB-Outcomes|Activity'!G$3:G$100,_xlfn.CONCAT(\"\",\"*\",$F11,\"*\"))","v":0},{"$f":"COUNTIF('DB-Outcomes|Activity'!H$3:K$100,_xlfn.CONCAT(\"\",\"*\",$F11,\"*\"))","v":0},"Transition into HE",{"$f":"COUNTIF('Intervention record'!K$4:K$100,_xlfn.CONCAT(\"\",\"*\",M11,\"*\"))","v":1},"Curriculum integration",{"$f":"COUNTIF('Intervention record'!L$4:L$100,_xlfn.CONCAT(\"\",\"*\",O11,\"*\"))","v":0},"Risk 8: Mental health",{"$f":"COUNTIF('Intervention record'!J$4:J$100,_xlfn.CONCAT(\"\",\"*\",Q11,\"*\"))","v":0},"Online"]
[null,null,"Ex-prisoner",{"$f":"COUNTIF('Intervention record'!C$4:C$100,_xlfn.CONCAT(\"\",\"*\",C12,\"*\"))","v":0},"Non-behavioural","preparedness for HE",{"$f":"COUNTIF('Intervention record'!E$4:E$100,_xlfn.CONCAT(\"\",\"*\",$F12,\"*\"))","v":0},{"$f":"COUNTIF('Intervention record'!F$4:I$100,_xlfn.CONCAT(\"\",\"*\",$F12,\"*\"))","v":0},{"$f":"COUNTIF('DB-Outcomes|Student Group'!G$3:G$100,_xlfn.CONCAT(\"\",\"*\",$F12,\"*\"))","v":0},{"$f":"COUNTIF('DB-Outcomes|Student Group'!H$3:K$100,_xlfn.CONCAT(\"\",\"*\",$F12,\"*\"))","v":0},{"$f":"COUNTIF('DB-Outcomes|Activity'!G$3:G$100,_xlfn.CONCAT(\"\",\"*\",$F12,\"*\"))","v":0},{"$f":"COUNTIF('DB-Outcomes|Activity'!H$3:K$100,_xlfn.CONCAT(\"\",\"*\",$F12,\"*\"))","v":0},"Transition within HE",{"$f":"COUNTIF('Intervention record'!K$4:K$100,_xlfn.CONCAT(\"\",\"*\",M12,\"*\"))","v":0},"Curriculum reform",{"$f":"COUNTIF('Intervention record'!L$4:L$100,_xlfn.CONCAT(\"\",\"*\",O12,\"*\"))","v":0},"Risk 9: Ongoing impacts of coronavirus",{"$f":"COUNTIF('Intervention record'!J$4:J$100,_xlfn.CONCAT(\"\",\"*\",Q12,\"*\"))","v":0},"Phone-call"]
[null,null,"First in family",{"$f":"COUNTIF('Intervention record'!C$4:C$100,_xlfn.CONCAT(\"\",\"*\",C13,\"*\"))","v":0},"Non-behavioural","sense of belonging",{"$f":"COUNTIF('Intervention record'!E$4:E$100,_xlfn.CONCAT(\"\",\"*\",$F13,\"*\"))","v":0},{"$f":"COUNTIF('Intervention record'!F$4:I$100,_xlfn.CONCAT(\"\",\"*\",$F13,\"*\"))","v":2},{"$f":"COUNTIF('DB-Outcomes|Student Group'!G$3:G$100,_xlfn.CONCAT(\"\",\"*\",$F13,\"*\"))","v":0},{"$f":"COUNTIF('DB-Outcomes|Student Group'!H$3:K$100,_xlfn.CONCAT(\"\",\"*\",$F13,\"*\"))","v":1},{"$f":"COUNTIF('DB-Outcomes|Activity'!G$3:G$100,_xlfn.CONCAT(\"\",\"*\",$F13,\"*\"))","v":0},{"$f":"COUNTIF('DB-Outcomes|Activity'!H$3:K$100,_xlfn.CONCAT(\"\",\"*\",$F13,\"*\"))","v":0},null,null,"Early induction",{"$f":"COUNTIF('Intervention record'!L$4:L$100,_xlfn.CONCAT(\"\",\"*\",O13,\"*\"))","v":0},"Risk 10: Cost pressures",{"$f":"COUNTIF('Intervention record'!J$4:J$100,_xlfn.CONCAT(\"\",\"*\",Q13,\"*\"))","v":0},"Seminar"]
[null,null,"Free school meals",{"$f":"COUNTIF('Intervention record'!C$4:C$100,_xlfn.CONCAT(\"\",\"*\",C14,\"*\"))","v":0},"Non-behavioural","skills and knowledge to successfully make the transition to HE",{"$f":"COUNTIF('Intervention record'!E$4:E$100,_xlfn.CONCAT(\"\",\"*\",$F14,\"*\"))","v":0},{"$f":"COUNTIF('Intervention record'!F$4:I$100,_xlfn.CONCAT(\"\",\"*\",$F14,\"*\"))","v":1},{"$f":"COUNTIF('DB-Outcomes|Student Group'!G$3:G$100,_xlfn.CONCAT(\"\",\"*\",$F14,\"*\"))","v":0},{"$f":"COUNTIF('DB-Outcomes|Student Group'!H$3:K$100,_xlfn.CONCAT(\"\",\"*\",$F14,\"*\"))","v":0},{"$f":"COUNTIF('DB-Outcomes|Activity'!G$3:G$100,_xlfn.CONCAT(\"\",\"*\",$F14,\"*\"))","v":0},{"$f":"COUNTIF('DB-Outcomes|Activity'!H$3:K$100,_xlfn.CONCAT(\"\",\"*\",$F14,\"*\"))","v":0},null,null,"Fee waivers",{"$f":"COUNTIF('Intervention record'!L$4:L$100,_xlfn.CONCAT(\"\",\"*\",O14,\"*\"))","v":0},"Risk 11: Capacity issues",{"$f":"COUNTIF('Intervention record'!J$4:J$100,_xlfn.CONCAT(\"\",\"*\",Q14,\"*\"))","v":0},"Synchronous"]
[null,null,"Gender identity",{"$f":"COUNTIF('Intervention record'!C$4:C$100,_xlfn.CONCAT(\"\",\"*\",C15,\"*\"))","v":0},"Non-behavioural","social self-efficacy",{"$f":"COUNTIF('Intervention record'!E$4:E$100,_xlfn.CONCAT(\"\",\"*\",$F15,\"*\"))","v":0},{"$f":"COUNTIF('Intervention record'!F$4:I$100,_xlfn.CONCAT(\"\",\"*\",$F15,\"*\"))","v":4},{"$f":"COUNTIF('DB-Outcomes|Student Group'!G$3:G$100,_xlfn.CONCAT(\"\",\"*\",$F15,\"*\"))","v":0},{"$f":"COUNTIF('DB-Outcomes|Student Group'!H$3:K$100,_xlfn.CONCAT(\"\",\"*\",$F15,\"*\"))","v":1},{"$f":"COUNTIF('DB-Outcomes|Activity'!G$3:G$100,_xlfn.CONCAT(\"\",\"*\",$F15,\"*\"))","v":0},{"$f":"COUNTIF('DB-Outcomes|Activity'!H$3:K$100,_xlfn.CONCAT(\"\",\"*\",$F15,\"*\"))","v":0},null,null,"Financial subsidy",{"$f":"COUNTIF('Intervention record'!L$4:L$100,_xlfn.CONCAT(\"\",\"*\",O15,\"*\"))","v":0},"Risk 12: Progression from higher education",{"$f":"COUNTIF('Intervention record'!J$4:J$100,_xlfn.CONCAT(\"\",\"*\",Q15,\"*\"))","v":0},"Text-message"]
{"$rows_left_out":23}
{"sheet":"EORR","index":10,"n_rows":16,"n_cols":5,"rows_kept":16,"cut":false,"hidden":true,"merged":[[2,0,2,2]]}
["Office for Students Equality of Opportunities Risk Register (EORR)"]
[]
["Lifecycle"]
["Access","On Course","Progression","Risk","Description"]
["X","X","X","Risk 1: Knowledge and skills","Students may not have equal opportunity to develop the knowledge and skills required to be accepted onto higher education courses that match their expectations and ambitions."]
["X","X","X","Risk 2: Information and guidance","Students may not have equal opportunity to receive the information and guidance that will enable them to develop ambition and expectations, or to make informed choice about their higher education options."]
["X","X","X","Risk 3: Perception of higher education","Students may not feel able to apply to higher education, or certain types of providers within higher education, despite being qualified."]
["X","X","X","Risk 4: Application success rates","Students may not be accepted to a higher education course, or may not be accepted to certain types of providers within higher education, despite being qualified."]
["X","X","X","Risk 5: Limited choice of course type and delivery mode","Students may not have equal opportunity to access a sufficiently wide variety of higher education course types."]
[null,"X","X","Risk 6: Insufficient academic support","Students may not receive sufficient personalised academic support to achieve a positive outcome."]
[null,"X","X","Risk 7: Insufficient personal support","Students may not receive sufficient personalised non-academic support or have sufficient access to extracurricular activities to achieve a positive outcome."]
[null,"X","X","Risk 8: Mental health","Students may not experience an environment that is conducive to good mental health and wellbeing."]
["X","X","X","Risk 9: Ongoing impacts of coronavirus","Students may be affected by the ongoing consequences of the coronavirus pandemic."]
["X","X","X","Risk 10: Cost pressures","Increases in cost pressures may affect a student’s ability to complete their course or obtain a good grade."]
["X","X","X","Risk 11: Capacity issues","Students may not have equal opportunity to access limited resources related to higher education, such as suitable accommodation."]
{"$rows_left_out":1}